BDBM50006523 (6-Fluoro-4-hydroxy-chroman-4-yl)-acetic acid::CHEMBL68635
SMILES OC(=O)C[C@]1(O)CCOc2ccc(F)cc12
InChI Key InChIKey=MDDBGPBRLJNBDZ-LLVKDONJSA-N
Data  1 IC50
  Tab Delimited (TSV)   2D SDfile   Computed 3D by Vconf -m prep SDfile
Find this compound or compounds like it in BindingDB:
Activity Spreadsheet -- Enzyme Inhibition Constant Data from BindingDB
Found 1 hit for monomerid = 50006523
TargetAldo-keto reductase family 1 member B1(Homo sapiens (Human))
Pfizer
Curated by ChEMBL
LigandPNGBDBM50006523((6-Fluoro-4-hydroxy-chroman-4-yl)-acetic acid | CH...)
Affinity DataIC50:  600nM. Assay description: Inhibitory activity against human placental aldose reductase
In DepthDetails ArticlePubMed